Target
Low affinity immunoglobulin epsilon Fc receptor
Ligand
BDBM50132438
Substrate
Meas. Tech.
ChEBML_163803
EC50
>30000±n/a nM
Citation
 Lai, JYCox, PJPatel, RSadiq, SAldous, DJThurairatnam, SSmith, KWheeler, DJagpal, SParveen, SFenton, GHarrison, TKMcCarthy, CBamborough, P Potent small molecule inhibitors of spleen tyrosine kinase (Syk). Bioorg Med Chem Lett 13:3111-4 (2003)  
Target
Name:
Low affinity immunoglobulin epsilon Fc receptor
Synonyms:
BLAST-2 CD_antigen=CD23 FCE2 FCER2_HUMAN IGEBF Immunoglobulin epsilon Fc receptor Low affinity immunoglobulin epsilon Fc receptor membrane-bound form Lymphocyte IgE receptor
Type:
PROTEIN
Mol. Mass.:
36461.84
Organism:
Homo sapiens (Human)
Description:
ChEMBL_88888
Residue:
321
  
Inhibitor
Name:
BDBM50132438
Synonyms:
2-Oxo-3-[1-[1-(4-oxo-4-piperidin-1-yl-butyl)-1H-indol-3-yl]-meth-(Z)-ylidene]-2,3-dihydro-1H-indole-5-sulfonic acid amide | CHEMBL316756
Type:
Small organic molecule
Emp. Form.:
C26H28N4O4S
Mol. Mass.:
492.59
SMILES:
NS(=O)(=O)c1ccc2NC(=O)\C(=C/c3cn(CCCC(=O)N4CCCCC4)c4ccccc34)c2c1
: