Target
Beta-galactoside alpha-2,6-sialyltransferase 1
Ligand
BDBM50366838
Substrate
Meas. Tech.
ChEMBL_216152 (CHEMBL817949)
Ki
2400000±n/a nM
Citation
 Whalen, LJMcEvoy, KAHalcomb, RL Synthesis and evaluation of phosphoramidate amino acid-based inhibitors of sialyltransferases. Bioorg Med Chem Lett 13:301-4 (2002)  
Target
Name:
Beta-galactoside alpha-2,6-sialyltransferase 1
Synonyms:
CMP-N-acetylneuraminate-beta-galactosamide-alpha-2,6-sialyltransferase Siat1 | St6gal1
Type:
PROTEIN
Mol. Mass.:
46743.36
Organism:
Rattus norvegicus
Description:
ChEMBL_216152
Residue:
403
  
Inhibitor
Name:
BDBM50366838
Synonyms:
CHEMBL609215
Type:
Small organic molecule
Emp. Form.:
C11H17N4O9P
Mol. Mass.:
380.2478
SMILES:
Nc1ccn(C2O[C@H](COP(O)(=O)NCC(O)=O)[C@@H](O)[C@H]2O)c(=O)n1
: