Target
Sphingosine 1-phosphate receptor 4
Ligand
BDBM50133417
Substrate
Meas. Tech.
ChEMBL_201444 (CHEMBL807590)
EC50
450±n/a nM
Citation
 Clemens, JJDavis, MDLynch, KRMacdonald, TL Synthesis of para-alkyl aryl amide analogues of sphingosine-1-phosphate: discovery of potent S1P receptor agonists. Bioorg Med Chem Lett 13:3401-4 (2003)  
Target
Name:
Sphingosine 1-phosphate receptor 4
Synonyms:
EDG6 S1P receptor 4 S1P4 S1PR4_HUMAN Sphingosine 1-phosphate receptor Edg-6 sphingosine-1-phosphate 4 S1P4
Type:
G Protein-Coupled Receptor (GPCR)
Mol. Mass.:
41647.39
Organism:
Homo sapiens (Human)
Description:
Residue:
384
  
Inhibitor
Name:
BDBM50133417
Synonyms:
CHEMBL334038 | Phosphoric acid mono-[(R)-2-amino-2-(4-decyl-phenylcarbamoyl)-ethyl] ester; TFA
Type:
Small organic molecule
Emp. Form.:
C19H33N2O5P
Mol. Mass.:
400.4495
SMILES:
CCCCCCCCCCc1ccc(NC(=O)[C@H](N)COP(O)(O)=O)cc1
: