Target
Transporter
Ligand
BDBM50133751
Substrate
Meas. Tech.
ChEBML_142643
Ki
33±n/a nM
Citation
 Zhou, JKläss, TZhang, AJohnson, KMWang, CZYe, YKozikowski, AP Synthesis and pharmacological evaluation of (Z)-9-(heteroarylmethylene)-7-azatricyclo[4.3.1.0(3,7)]decanes: thiophene analogues as potent norepinephrine transporter inhibitors. Bioorg Med Chem Lett 13:3565-9 (2003)  
Target
Name:
Transporter
Synonyms:
Monoamine transporters; Norepininephrine & dopamine | Norepinephrine Monoamine transporters
Type:
PROTEIN
Mol. Mass.:
66787.87
Organism:
Rattus norvegicus
Description:
ChEMBL_1463061
Residue:
597
  
Inhibitor
Name:
BDBM50133751
Synonyms:
9-[1-Thiophen-3-yl-meth-(Z)-ylidene]-7-aza-tricyclo[4.3.1.0*3,7*]decane-2-carboxylic acid methyl ester | CHEMBL333912
Type:
Small organic molecule
Emp. Form.:
C16H19NO2S
Mol. Mass.:
289.393
SMILES:
COC(=O)C1C2CCC3CC1\C(CN23)=C\c1ccsc1
: