Target
Steryl-sulfatase
Ligand
BDBM50136297
Substrate
Meas. Tech.
ChEMBL_203059 (CHEMBL811563)
Ki
6000±n/a nM
Citation
 Schreiner, EPWolff, BWiniski, APBillich, A 6-(2-adamantan-2-ylidene-hydroxybenzoxazole)-O-sulfamate: a potent non-steroidal irreversible inhibitor of human steroid sulfatase. Bioorg Med Chem Lett 13:4313-6 (2003)  
Target
Name:
Steryl-sulfatase
Synonyms:
ARSC1 Arylsulfatase C STS_HUMAN Steryl-sulfate sulfohydrolase
Type:
Enzyme
Mol. Mass.:
65503.66
Organism:
Homo sapiens (Human)
Description:
P08842
Residue:
583
  
Inhibitor
Name:
BDBM50136297
Synonyms:
CHEMBL136112 | Sulfamic acid 2-adamantan-2-ylidenemethyl-benzooxazol-6-yl ester
Type:
Small organic molecule
Emp. Form.:
C18H20N2O4S
Mol. Mass.:
360.427
SMILES:
NS(=O)(=O)Oc1ccc2nc(C=C3C4CC5CC(C4)CC3C5)oc2c1
: