Target
Kappa-type opioid receptor
Ligand
BDBM82551
Substrate
Meas. Tech.
ChEMBL_146237 (CHEMBL755005)
Ki
0.120000±n/a nM
Citation
 Ananthan, SKezar, HSSaini, SKKhare, NKDavis, PDersch, CMPorreca, FRothman, RB Synthesis, opioid receptor binding, and functional activity of 5'-substituted 17-cyclopropylmethylpyrido[2',3':6,7]morphinans. Bioorg Med Chem Lett 13:529-32 (2003)  
Target
Name:
Kappa-type opioid receptor
Synonyms:
Kappa Opioid Receptor OPRK1 Opiate Kappa 1 | mu/kappa opioid receptor
Type:
G Protein-Coupled Receptor (GPCR)
Mol. Mass.:
42744.99
Organism:
Cavia porcellus (domestic guinea pig)
Description:
P41144
Residue:
380
  
Inhibitor
Name:
BDBM82551
Synonyms:
C18130 NOR-BNI (HCI)2 | NORBNI
Type:
Small organic molecule
Emp. Form.:
C40H43N3O6
Mol. Mass.:
661.7859
SMILES:
Oc1ccc2C[C@H]3N(CC4CC4)CC[C@@]45[C@@H](Oc1c24)c1[nH]c2[C@@H]4Oc6c7c(C[C@H]8N(CC9CC9)CC[C@@]47[C@@]8(O)Cc2c1C[C@@]35O)ccc6O
: