Target
Adenosine receptor A1
Ligand
BDBM50124120
Substrate
Meas. Tech.
ChEBML_29472
Ki
17100±n/a nM
Citation
 Lim, MHKim, HOMoon, HRLee, SJChun, MWGao, ZGMelman, NJacobson, KAKim, JHJeong, LS Design, synthesis and binding affinity of 3'-fluoro analogues of Cl-IB-MECA as adenosine A3 receptor ligands. Bioorg Med Chem Lett 13:817-20 (2003)  
Target
Name:
Adenosine receptor A1
Synonyms:
AA1R_RAT ADENOSINE A1 high Adenosine A1 receptor (A1) Adenosine receptors A1 | Adora1
Type:
Protein
Mol. Mass.:
36704.13
Organism:
Rattus norvegicus (rat)
Description:
Residue:
326
  
Inhibitor
Name:
BDBM50124120
Synonyms:
2-[2-chloro-6-(methylamino)-9H-purin-9-yl]-4-fluoro-5-(hydroxymethyl)tetrahydrofuran-3-ol | CHEMBL168843
Type:
Small organic molecule
Emp. Form.:
C11H13ClFN5O3
Mol. Mass.:
317.704
SMILES:
CNc1nc(Cl)nc2n(cnc12)C1OC(CO)C(F)C1O
: