Target
Lecithin retinol acyltransferase
Ligand
BDBM8580
Substrate
Meas. Tech.
ChEMBL_96915 (CHEMBL707894)
IC50
102000±n/a nM
Citation
 Ryu, DHTan, CHRando, RR Synthesis of (+),(-)-neamine and their positional isomers as potential antibiotics. Bioorg Med Chem Lett 13:901-3 (2003)  
Target
Name:
Lecithin retinol acyltransferase
Synonyms:
LRAT Lecithin retinol acyltransferase Phosphatidylcholine-retinol O-acyltransferase
Type:
PROTEIN
Mol. Mass.:
25705.63
Organism:
Homo sapiens (Human)
Description:
ChEMBL_96915
Residue:
230
  
Inhibitor
Name:
BDBM8580
Synonyms:
(2R,3S,4R,5R,6R)-5-amino-2-(aminomethyl)-6-{[(1R,2R,3S,4R,6S)-4,6-diamino-2,3-dihydroxycyclohexyl]oxy}oxane-3,4-diol | Neamine
Type:
Small organic molecule
Emp. Form.:
C12H26N4O6
Mol. Mass.:
322.358
SMILES:
NC[C@H]1O[C@H](O[C@@H]2[C@@H](N)C[C@@H](N)[C@H](O)[C@H]2O)[C@H](N)[C@@H](O)[C@@H]1O
: