Target
Tyrosine-protein kinase SYK
Ligand
BDBM50366881
Substrate
Meas. Tech.
ChEMBL_206954 (CHEMBL814841)
Kd
4000±n/a nM
Citation
 Dekker, FJde Mol, NJFischer, MJLiskamp, RM Amino propynyl benzoic acid building block in rigid spacers of divalent ligands binding to the Syk SH2 domains with equally high affinity as the natural ligand. Bioorg Med Chem Lett 13:1241-4 (2003)  
Target
Name:
Tyrosine-protein kinase SYK
Synonyms:
KSYK_HUMAN Spleen Tyrosine Kinase Tyrosine-protein kinase SYK (Syk)
Type:
Enzyme
Mol. Mass.:
72079.99
Organism:
Homo sapiens (Human)
Description:
P43405
Residue:
635
  
Inhibitor
Name:
BDBM50366881
Synonyms:
CHEMBL1793843
Type:
Small organic molecule
Emp. Form.:
C61H84N12O24P2
Mol. Mass.:
1431.3332
SMILES:
CC(C)C[C@H](NC(=O)[C@@H](NC(=O)[C@H](CCC(O)=O)NC(=O)[C@H](Cc1ccc(OP(O)(O)=O)cc1)NC(=O)CNC(=O)c1ccc(cc1)C#CCNC(=O)CNC(=O)[C@H](CC(C)C)NC(=O)CNC(=O)[C@@H](NC(=O)[C@H](Cc1ccc(OP(O)(O)=O)cc1)NC(C)=O)[C@@H](C)O)[C@@H](C)O)C(N)=O
: