Target
Beta-secretase 1
Ligand
BDBM50137686
Substrate
Meas. Tech.
ChEMBL_41388 (CHEMBL653510)
IC50
41±n/a nM
Citation
 Lamar, JHu, JBueno, ABYang, HCGuo, DCopp, JDMcGee, JGitter, BTimm, DMay, PMcCarthy, JChen, SH Phe*-Ala-based pentapeptide mimetics are BACE inhibitors: P2 and P3 SAR. Bioorg Med Chem Lett 14:239-43 (2003)  
Target
Name:
Beta-secretase 1
Synonyms:
ASP2 Aspartyl protease 2 BACE1 Beta-secretase (BACE) Beta-secretase 1 (BACE 1) Beta-secretase 1 (BACE1) Beta-site amyloid precursor protein cleaving enzyme 1 Memapsin-2 beta-Secretase (BACE-1) | beta-Secretase (BACE1)
Type:
Protein
Mol. Mass.:
55755.10
Organism:
Homo sapiens (Human)
Description:
P56817
Residue:
501
  
Inhibitor
Name:
BDBM50137686
Synonyms:
CHEMBL78781 | {(S)-1-[(S)-1-((2S,4S)-1-Benzyl-2-hydroxy-4-{(R)-2-methyl-1-[(pyridin-4-ylmethyl)-carbamoyl]-propylcarbamoyl}-pentylcarbamoyl)-ethylcarbamoyl]-butyl}-carbamic acid tert-butyl ester
Type:
Small organic molecule
Emp. Form.:
C37H56N6O7
Mol. Mass.:
696.8765
SMILES:
CCC[C@H](NC(=O)OC(C)(C)C)C(=O)N[C@@H](C)C(=O)N[C@@H](Cc1ccccc1)[C@@H](O)C[C@@H](C)C(=O)N[C@@H](C(C)C)C(=O)NCc1ccncc1
: