Target
Beta-secretase 1
Ligand
BDBM50137697
Substrate
Meas. Tech.
ChEMBL_41387 (CHEMBL653509)
IC50
60±n/a nM
Citation
 Chen, SHLamar, JGuo, DKohn, TYang, HCMcGee, JTimm, DErickson, JYip, YMay, PMcCarthy, J P3 cap modified Phe*-Ala series BACE inhibitors. Bioorg Med Chem Lett 14:245-50 (2003)  
Target
Name:
Beta-secretase 1
Synonyms:
ASP2 Aspartyl protease 2 BACE1 Beta-secretase (BACE) Beta-secretase 1 (BACE 1) Beta-secretase 1 (BACE1) Beta-site amyloid precursor protein cleaving enzyme 1 Memapsin-2 beta-Secretase (BACE-1) | beta-Secretase (BACE1)
Type:
Protein
Mol. Mass.:
55755.10
Organism:
Homo sapiens (Human)
Description:
P56817
Residue:
501
  
Inhibitor
Name:
BDBM50137697
Synonyms:
(S)-2-Ethyl-4-(S)-hydroxy-5-[(S)-2-((S)-2-hydroxy-3-methyl-butyrylamino)-propionylamino]-6-phenyl-hexanoic acid [(S)-2-methyl-1-((S)-1-phenyl-ethylcarbamoyl)-propyl]-amide | CHEMBL84249
Type:
Small organic molecule
Emp. Form.:
C35H52N4O6
Mol. Mass.:
624.8106
SMILES:
CC[C@H](C[C@H](O)[C@H](Cc1ccccc1)NC(=O)[C@H](C)NC(=O)[C@@H](O)C(C)C)C(=O)N[C@@H](C(C)C)C(=O)N[C@@H](C)c1ccccc1
: