Target
Sodium-dependent serotonin transporter
Ligand
BDBM50145352
Substrate
Meas. Tech.
ChEBML_201998
Ki
2.1±n/a nM
Citation
 Timms, GHBoot, JRBroadmore, RJCarney, SLCooper, JFindlay, JDGilmore, JMitchell, SMoore, NAPullar, ISanger, GJTomlinson, RTree, BBWedley, S SAR development of a selective 5-HT1D antagonist/serotonin reuptake inhibitor lead using rapid parallel synthesis. Bioorg Med Chem Lett 14:2469-72 (2004)  
Target
Name:
Sodium-dependent serotonin transporter
Synonyms:
5-HT Transporter 5HT transporter Anandamid membrane transporter, AMT Monoamine transporters; Norepinephrine & serotonin Slc6a4 Sodium-dependent serotonin transporter (SERT) | imipramine receptor
Type:
Multi-pass membrane protein
Mol. Mass.:
70168.43
Organism:
Rattus norvegicus (rat)
Description:
P31652
Residue:
630
  
Inhibitor
Name:
BDBM50145352
Synonyms:
1-{2-[3-(6-Fluoro-1H-indol-3-yl)-pyrrolidin-1-yl]-ethyl}-isochroman-6-carboxylic acid amide | CHEMBL79725
Type:
Small organic molecule
Emp. Form.:
C24H26FN3O2
Mol. Mass.:
407.4805
SMILES:
NC(=O)c1ccc2C(CCN3CCC(C3)c3c[nH]c4cc(F)ccc34)OCCc2c1
: