Target
Vasopressin V2 receptor
Ligand
BDBM50146290
Substrate
Meas. Tech.
ChEBML_214260
Ki
300±n/a nM
Citation
 Matthews, JMHoekstra, WJDyatkin, ABHecker, LRHlasta, DJPoulter, BLAndrade-Gordon, Pde Garavilla, LDemarest, KTEricson, EGunnet, JWHageman, WLook, RMoore, JBReynolds, CHMaryanoff, BE Potent nonpeptide vasopressin receptor antagonists based on oxazino- and thiazinobenzodiazepine templates. Bioorg Med Chem Lett 14:2747-52 (2004)  
Target
Name:
Vasopressin V2 receptor
Synonyms:
ADHR AVPR2 DIR Renal-type arginine vasopressin receptor V2R_HUMAN Vasopressin V2 receptor | Vasopressin receptor
Type:
Receptor
Mol. Mass.:
40295.28
Organism:
Homo sapiens (Human)
Description:
P30518
Residue:
371
  
Inhibitor
Name:
BDBM50146290
Synonyms:
CHEMBL330494 | N-[3-Chloro-4-(3,4,11,11a-tetrahydro-1H,5H-2-thia-4a,10-diaza-dibenzo[a,d]cycloheptene-10-carbonyl)-phenyl]-5-fluoro-2-methyl-benzamide
Type:
Small organic molecule
Emp. Form.:
C27H25ClFN3O2S
Mol. Mass.:
510.023
SMILES:
Cc1ccc(F)cc1C(=O)Nc1ccc(C(=O)N2CC3CSCCN3Cc3ccccc23)c(Cl)c1
: