Target
Vasopressin V2 receptor
Ligand
BDBM50146303
Substrate
Meas. Tech.
ChEMBL_214260 (CHEMBL818586)
Ki
17±n/a nM
Citation
 Matthews, JMHoekstra, WJDyatkin, ABHecker, LRHlasta, DJPoulter, BLAndrade-Gordon, Pde Garavilla, LDemarest, KTEricson, EGunnet, JWHageman, WLook, RMoore, JBReynolds, CHMaryanoff, BE Potent nonpeptide vasopressin receptor antagonists based on oxazino- and thiazinobenzodiazepine templates. Bioorg Med Chem Lett 14:2747-52 (2004)  
Target
Name:
Vasopressin V2 receptor
Synonyms:
ADHR AVPR2 DIR Renal-type arginine vasopressin receptor V2R_HUMAN Vasopressin V2 receptor | Vasopressin receptor
Type:
Receptor
Mol. Mass.:
40295.28
Organism:
Homo sapiens (Human)
Description:
P30518
Residue:
371
  
Inhibitor
Name:
BDBM50146303
Synonyms:
Biphenyl-2-carboxylic acid [3-chloro-4-((S)-3,4,11,11a-tetrahydro-1H,5H-2-thia-4a,10-diaza-dibenzo[a,d]cycloheptene-10-carbonyl)-phenyl]-amide; hydrochloride | CHEMBL539285
Type:
Small organic molecule
Emp. Form.:
C32H28ClN3O2S
Mol. Mass.:
554.102
SMILES:
Clc1cc(NC(=O)c2ccccc2-c2ccccc2)ccc1C(=O)N1C[C@H]2CSCCN2Cc2ccccc12
: