Target
Vasopressin V1a receptor
Ligand
BDBM50146303
Substrate
Meas. Tech.
ChEMBL_214540 (CHEMBL819377)
Ki
250±n/a nM
Citation
 Matthews, JMHoekstra, WJDyatkin, ABHecker, LRHlasta, DJPoulter, BLAndrade-Gordon, Pde Garavilla, LDemarest, KTEricson, EGunnet, JWHageman, WLook, RMoore, JBReynolds, CHMaryanoff, BE Potent nonpeptide vasopressin receptor antagonists based on oxazino- and thiazinobenzodiazepine templates. Bioorg Med Chem Lett 14:2747-52 (2004)  
Target
Name:
Vasopressin V1a receptor
Synonyms:
AVPR V1a AVPR1A V1AR_HUMAN VASOPRESSIN V1A Vasopressin V1 receptor Vasopressin receptor
Type:
Receptor
Mol. Mass.:
46820.18
Organism:
Homo sapiens (Human)
Description:
P37288
Residue:
418
  
Inhibitor
Name:
BDBM50146303
Synonyms:
Biphenyl-2-carboxylic acid [3-chloro-4-((S)-3,4,11,11a-tetrahydro-1H,5H-2-thia-4a,10-diaza-dibenzo[a,d]cycloheptene-10-carbonyl)-phenyl]-amide; hydrochloride | CHEMBL539285
Type:
Small organic molecule
Emp. Form.:
C32H28ClN3O2S
Mol. Mass.:
554.102
SMILES:
Clc1cc(NC(=O)c2ccccc2-c2ccccc2)ccc1C(=O)N1C[C@H]2CSCCN2Cc2ccccc12
: