Target
Vasopressin V2 receptor
Ligand
BDBM50404244
Substrate
Meas. Tech.
ChEMBL_214260 (CHEMBL818586)
Ki
170±n/a nM
Citation
 Matthews, JMHoekstra, WJDyatkin, ABHecker, LRHlasta, DJPoulter, BLAndrade-Gordon, Pde Garavilla, LDemarest, KTEricson, EGunnet, JWHageman, WLook, RMoore, JBReynolds, CHMaryanoff, BE Potent nonpeptide vasopressin receptor antagonists based on oxazino- and thiazinobenzodiazepine templates. Bioorg Med Chem Lett 14:2747-52 (2004)  
Target
Name:
Vasopressin V2 receptor
Synonyms:
ADHR AVPR2 DIR Renal-type arginine vasopressin receptor V2R_HUMAN Vasopressin V2 receptor | Vasopressin receptor
Type:
Receptor
Mol. Mass.:
40295.28
Organism:
Homo sapiens (Human)
Description:
P30518
Residue:
371
  
Inhibitor
Name:
BDBM50404244
Synonyms:
CHEMBL2093899
Type:
Small organic molecule
Emp. Form.:
C32H28ClN3O3
Mol. Mass.:
538.036
SMILES:
Clc1cc(NC(=O)c2ccccc2-c2ccccc2)ccc1C(=O)N1C[C@@H]2COCCN2Cc2ccccc12
: