Target
Vasopressin V1a receptor
Ligand
BDBM50146289
Substrate
Meas. Tech.
ChEMBL_214539 (CHEMBL819376)
Ki
1900±n/a nM
Citation
 Matthews, JMHoekstra, WJDyatkin, ABHecker, LRHlasta, DJPoulter, BLAndrade-Gordon, Pde Garavilla, LDemarest, KTEricson, EGunnet, JWHageman, WLook, RMoore, JBReynolds, CHMaryanoff, BE Potent nonpeptide vasopressin receptor antagonists based on oxazino- and thiazinobenzodiazepine templates. Bioorg Med Chem Lett 14:2747-52 (2004)  
Target
Name:
Vasopressin V1a receptor
Synonyms:
AVPR V1a AVPR1A V1AR_HUMAN VASOPRESSIN V1A Vasopressin V1 receptor Vasopressin receptor
Type:
Receptor
Mol. Mass.:
46820.18
Organism:
Homo sapiens (Human)
Description:
P37288
Residue:
418
  
Inhibitor
Name:
BDBM50146289
Synonyms:
4-Hydroxy-biphenyl-2-carboxylic acid [3-chloro-4-((S)-3,4,11,11a-tetrahydro-1H,5H-2-oxa-4a,10-diaza-dibenzo[a,d]cycloheptene-10-carbonyl)-phenyl]-amide | CHEMBL329141
Type:
Small organic molecule
Emp. Form.:
C32H28ClN3O4
Mol. Mass.:
554.035
SMILES:
Oc1ccc(-c2ccccc2)c(c1)C(=O)Nc1ccc(C(=O)N2C[C@H]3COCCN3Cc3ccccc23)c(Cl)c1
: