Target
Vasopressin V1a receptor
Ligand
BDBM50366914
Substrate
Meas. Tech.
ChEBML_214405
IC50
4±n/a nM
Citation
 Xiang, MAChen, RHDemarest, KTGunnet, JLook, RHageman, WMurray, WVCombs, DWRybczynski, PJPatel, M Synthesis and evaluation of nonpeptide substituted spirobenzazepines as potent vasopressin antagonists. Bioorg Med Chem Lett 14:3143-6 (2004)  
Target
Name:
Vasopressin V1a receptor
Synonyms:
AVPR V1a AVPR1A V1AR_HUMAN VASOPRESSIN V1A Vasopressin V1 receptor Vasopressin receptor
Type:
Receptor
Mol. Mass.:
46820.18
Organism:
Homo sapiens (Human)
Description:
P37288
Residue:
418
  
Inhibitor
Name:
BDBM50366914
Synonyms:
CHEMBL1788221
Type:
Small organic molecule
Emp. Form.:
C33H35FN4O3
Mol. Mass.:
554.6544
SMILES:
CN(C)CCNC(=O)C1=C[C@@]2(CC1)CCN(C(=O)c1ccc(NC(=O)c3ccccc3F)cc1)c1ccccc1C2
: