Target
4-galactosyl-N-acetylglucosaminide 3-alpha-L-fucosyltransferase FUT6
Ligand
BDBM50366918
Substrate
Meas. Tech.
ChEMBL_69261 (CHEMBL677079)
IC50
1618±n/a nM
Citation
 Bryan, MCLee, LVWong, CH High-throughput identification of fucosyltransferase inhibitors using carbohydrate microarrays. Bioorg Med Chem Lett 14:3185-8 (2004)  
Target
Name:
4-galactosyl-N-acetylglucosaminide 3-alpha-L-fucosyltransferase FUT6
Synonyms:
Alpha-(1,3)-fucosyltransferase IV FUT6 Fucosyltransferase 6 Fuct IV
Type:
Mol. Mass.:
41871.43
Organism:
Homo sapiens (Human)
Description:
P51993
Residue:
359
  
Inhibitor
Name:
BDBM50366918
Synonyms:
CHEMBL610391
Type:
Small organic molecule
Emp. Form.:
C29H33N9O12P2
Mol. Mass.:
761.5729
SMILES:
Nc1nc2n(cnc2c(=O)[nH]1)C1O[C@H](COP(O)(=O)OP(O)(=O)OCc2cn(CC(=O)NC(Cc3ccccc3)c3ccccc3)nn2)[C@@H](O)[C@H]1O
: