Target
Matrix metalloproteinase-14
Ligand
BDBM50148216
Substrate
Meas. Tech.
ChEMBL_106790 (CHEMBL873933)
IC50
7.4±n/a nM
Citation
 Reiter, LARobinson, RPMcClure, KFJones, CSReese, MRMitchell, PGOtterness, IGBliven, MLLiras, JCortina, SRDonahue, KMEskra, JDGriffiths, RJLame, MELopez-Anaya, AMartinelli, GJMcGahee, SMYocum, SALopresti-Morrow, LLTobiassen, LMVaughn-Bowser, ML Pyran-containing sulfonamide hydroxamic acids: potent MMP inhibitors that spare MMP-1. Bioorg Med Chem Lett 14:3389-95 (2004)  
Target
Name:
Matrix metalloproteinase-14
Synonyms:
MMP-14 MMP14 MT-MMP 1 MT1MMP Matrix Metalloproteinase-14 (MMP-14) Matrix metalloproteinase-14 Membrane-type matrix metalloproteinase 1 | Membrane-type-1 matrix metalloproteinase
Type:
Protein
Mol. Mass.:
65900.19
Organism:
Homo sapiens (Human)
Description:
P50281
Residue:
582
  
Inhibitor
Name:
BDBM50148216
Synonyms:
4-[4-(4-Fluoro-phenoxy)-benzenesulfonylamino]-tetrahydro-pyran-4-carboxylic acid hydroxyamide | CHEMBL111856
Type:
Small organic molecule
Emp. Form.:
C18H19FN2O6S
Mol. Mass.:
410.417
SMILES:
ONC(=O)C1(CCOCC1)NS(=O)(=O)c1ccc(Oc2ccc(F)cc2)cc1
: