Target
Sphingosine 1-phosphate receptor 4
Ligand
BDBM50147703
Substrate
Meas. Tech.
ChEBML_201448
IC50
16±n/a nM
Citation
 Hale, JJDoherty, GToth, LLi, ZMills, SGHajdu, RAnn Keohane, CRosenbach, MMilligan, JShei, GJChrebet, GBergstrom, JCard, DRosen, HMandala, S The discovery of 3-(N-alkyl)aminopropylphosphonic acids as potent S1P receptor agonists. Bioorg Med Chem Lett 14:3495-9 (2004)  
Target
Name:
Sphingosine 1-phosphate receptor 4
Synonyms:
EDG6 S1P receptor 4 S1P4 S1PR4_HUMAN Sphingosine 1-phosphate receptor Edg-6 sphingosine-1-phosphate 4 S1P4
Type:
G Protein-Coupled Receptor (GPCR)
Mol. Mass.:
41647.39
Organism:
Homo sapiens (Human)
Description:
Residue:
384
  
Inhibitor
Name:
BDBM50147703
Synonyms:
CHEMBL115554 [(1S,3R)-3-Amino-1-hydroxy-5-(4-octyl-phenyl)-pentyl]-phosphonic acid
Type:
Small organic molecule
Emp. Form.:
C19H34NO4P
Mol. Mass.:
371.4513
SMILES:
CCCCCCCCc1ccc(CC[C@@H](N)CC(=O)P(O)(O)O)cc1
: