Target
Gastrin/cholecystokinin type B receptor
Ligand
BDBM50092405
Substrate
Meas. Tech.
ChEBML_48600
Ki
>3000±n/a nM
Citation
 Bellier, BDugave, CEtivant, FGenet, RGigoux, VGarbay, C Synthesis and biological characterisation of [3H]BBL454, a new CCK2 selective radiolabelled agonist displaying original pharmacological properties. Bioorg Med Chem Lett 14:369-72 (2003)  
Target
Name:
Gastrin/cholecystokinin type B receptor
Synonyms:
Cckbr Cholecystokinin B receptor GASR_RAT | Gastrin/cholecystokinin type B receptor
Type:
Enzyme Catalytic Domain
Mol. Mass.:
48980.43
Organism:
RAT
Description:
Cholecystokinin A CCKBR RAT::P30553
Residue:
452
  
Inhibitor
Name:
BDBM50092405
Synonyms:
(S)-N-((S)-1-Carbamoyl-2-phenyl-ethyl)-3-((S)-2-{[(S)-2-(2-carboxy-acetylamino)-3-(1H-indol-3-yl)-propionyl]-methyl-amino}-hexanoylamino)-succinamic acid N-(1-Carbamoyl-2-phenyl-ethyl)-3-(2-{[2-(2-carboxy-acetylamino)-3-(1H-indol-3-yl)-propionyl]-methyl-amino}-hexanoylamino)-succinamic acid
Type:
Small organic molecule
Emp. Form.:
C34H42N6O9
Mol. Mass.:
678.7321
SMILES:
CCCC[C@H](N(C)C(=O)[C@H](Cc1c[nH]c2ccccc12)NC(=O)CC(O)=O)C(=O)N[C@@H](CC(O)=O)C(=O)N[C@@H](Cc1ccccc1)C(N)=O
: