Target
Epidermal growth factor receptor
Ligand
BDBM50122562
Substrate
Meas. Tech.
ChEMBL_63780 (CHEMBL677384)
IC50
87±n/a nM
Citation
 Wissner, AHamann, PRNilakantan, RGreenberger, LMYe, FRapuano, TALoganzo, F Syntheses and EGFR kinase inhibitory activity of 6-substituted-4-anilino [1,7] and [1,8] naphthyridine-3-carbonitriles. Bioorg Med Chem Lett 14:1411-6 (2004)  
Target
Name:
Epidermal growth factor receptor
Synonyms:
EGF Receptor Substrate EGFR_HUMAN ERBB1 Epidermal Growth Factor Receptor erbB-1 Epidermal growth factor receptor (EGFR) HER1 Proto-oncogene c-ErbB-1 Tyrosine-Protein Kinase ErbB-1
Type:
Receptor Kinase Domain
Mol. Mass.:
134279.59
Organism:
Homo sapiens (Human)
Description:
P00533
Residue:
1210
  
Inhibitor
Name:
BDBM50122562
Synonyms:
CHEMBL281300 | N-[4-(3-Bromo-phenylamino)-3-cyano-quinolin-6-yl]-acrylamide
Type:
Small organic molecule
Emp. Form.:
C19H13BrN4O
Mol. Mass.:
393.237
SMILES:
Brc1cccc(Nc2c(cnc3ccc(NC(=O)C=C)cc23)C#N)c1
: