Target
Fatty acid synthase
Ligand
BDBM50291713
Substrate
Meas. Tech.
ChEBML_68769
Ki
140000000±n/a nM
Citation
 Guérard, CBréard, MCourtois, FDrujon, TPloux, O Synthesis and evaluation of analogues of S-adenosyl-L-methionine, as inhibitors of the E. coli cyclopropane fatty acid synthase. Bioorg Med Chem Lett 14:1661-4 (2004)  
Target
Name:
Fatty acid synthase
Synonyms:
FAS FAS_HUMAN HU FASN
Type:
Enzyme
Mol. Mass.:
273419.37
Organism:
Homo sapiens (Human)
Description:
P49327
Residue:
2511
  
Inhibitor
Name:
BDBM50291713
Synonyms:
((S)-3-Amino-3-carboxy-propyl)-dimethyl-sulfonium | CHEMBL540394
Type:
Small organic molecule
Emp. Form.:
C6H14NO2S
Mol. Mass.:
164.245
SMILES:
C[S+](C)CC[C@H](N)C(O)=O
: