Target
Neuronal acetylcholine receptor subunit alpha-4/beta-4
Ligand
BDBM50026220
Substrate
Meas. Tech.
ChEMBL_144016 (CHEMBL750431)
Ki
34000±n/a nM
Citation
 Xiao, YBaydyuk, MWang, HPDavis, HEKellar, KJ Pharmacology of the agonist binding sites of rat neuronal nicotinic receptor subtypes expressed in HEK 293 cells. Bioorg Med Chem Lett 14:1845-8 (2004)  
Target
Name:
Neuronal acetylcholine receptor subunit alpha-4/beta-4
Synonyms:
Neuronal acetylcholine receptor protein alpha-4/beta-4 subunit nAChR subtypes alpha4 beta4
Type:
Mol. Mass.:
Description:
ASSAY_ID of EBI is 144014
Components:
This complex has 2 components.
Component 1
Name:
Neuronal acetylcholine receptor subunit alpha-4
Synonyms:
ACHA4_RAT Cholinergic, Nicotinic Alpha4Beta2 Chrna4 Neuronal acetylcholine receptor (alpha4beta2 nAChR) Neuronal acetylcholine receptor subunit alpha 4 beta 2 | Neuronal acetylcholine receptor subunit alpha-4
Type:
Enzyme
Mol. Mass.:
70196.44
Organism:
Rattus norvegicus (Rat)
Description:
P09483
Residue:
630
  
Component 2
Name:
Neuronal acetylcholine receptor subunit beta-4
Synonyms:
ACHB4_RAT Chrnb4 Neuronal acetylcholine receptor non-alpha-2 chain | Neuronal acetylcholine receptor protein beta-4 subunit
Type:
Enzyme
Mol. Mass.:
55863.89
Organism:
Rattus norvegicus (Rat)
Description:
P12392
Residue:
495
  
Inhibitor
Name:
BDBM50026220
Synonyms:
2-hydroxy-N,N,N-trimethylethanaminium CHEMBL293410 N-trimethylethanolamine choline | trimethylethanolamine
Type:
Small organic molecule
Emp. Form.:
C5H14NO
Mol. Mass.:
104.1702
SMILES:
C[N+](C)(C)CCO
: