Target
Protein phosphatase 1B
Ligand
BDBM50143510
Substrate
Meas. Tech.
ChEBML_161760
IC50
>100000±n/a nM
Citation
 Hart, MEChamberlin, ARWalkom, CSakoff, JAMcCluskey, A Modified norcantharidins; synthesis, protein phosphatases 1 and 2A inhibition, and anticancer activity. Bioorg Med Chem Lett 14:1969-73 (2004)  
Target
Name:
Protein phosphatase 1B
Synonyms:
PP2C-beta PPM1B Protein phosphatase 1B Protein phosphatase 2C isoform beta
Type:
PROTEIN
Mol. Mass.:
52620.37
Organism:
Homo sapiens (Human)
Description:
ChEMBL_161756
Residue:
479
  
Inhibitor
Name:
BDBM50143510
Synonyms:
(1S,4R)-3-(4-Chloro-phenylcarbamoyl)-7-oxa-bicyclo[2.2.1]hept-5-ene-2-carboxylic acid methyl ester | CHEMBL174701
Type:
Small organic molecule
Emp. Form.:
C15H14ClNO4
Mol. Mass.:
307.729
SMILES:
COC(=O)C1[C@H]2O[C@H](C=C2)C1C(=O)Nc1ccc(Cl)cc1
: