Target
Protein phosphatase 1B
Ligand
BDBM50143521
Substrate
Meas. Tech.
ChEBML_161760
IC50
>100000±n/a nM
Citation
 Hart, MEChamberlin, ARWalkom, CSakoff, JAMcCluskey, A Modified norcantharidins; synthesis, protein phosphatases 1 and 2A inhibition, and anticancer activity. Bioorg Med Chem Lett 14:1969-73 (2004)  
Target
Name:
Protein phosphatase 1B
Synonyms:
PP2C-beta PPM1B Protein phosphatase 1B Protein phosphatase 2C isoform beta
Type:
PROTEIN
Mol. Mass.:
52620.37
Organism:
Homo sapiens (Human)
Description:
ChEMBL_161756
Residue:
479
  
Inhibitor
Name:
BDBM50143521
Synonyms:
CHEMBL368606 | N-((1S,2R,7R)-3,5-Dioxo-4,10-dioxa-tricyclo[5.2.1.0*2,6*]dec-1-ylmethyl)-acetamide
Type:
Small organic molecule
Emp. Form.:
C11H13NO5
Mol. Mass.:
239.2246
SMILES:
CC(=O)NC[C@@]12CC[C@@H](O1)C1[C@H]2C(=O)OC1=O
: