Target
Protein phosphatase 1B
Ligand
BDBM50143509
Substrate
Meas. Tech.
ChEBML_161760
IC50
18000±n/a nM
Citation
 Hart, MEChamberlin, ARWalkom, CSakoff, JAMcCluskey, A Modified norcantharidins; synthesis, protein phosphatases 1 and 2A inhibition, and anticancer activity. Bioorg Med Chem Lett 14:1969-73 (2004)  
Target
Name:
Protein phosphatase 1B
Synonyms:
PP2C-beta PPM1B Protein phosphatase 1B Protein phosphatase 2C isoform beta
Type:
PROTEIN
Mol. Mass.:
52620.37
Organism:
Homo sapiens (Human)
Description:
ChEMBL_161756
Residue:
479
  
Inhibitor
Name:
BDBM50143509
Synonyms:
(1S,4R)-3-Dimethylcarbamoyl-7-oxa-bicyclo[2.2.1]hept-5-ene-2-carboxylatedimethyl-ammonium; | CHEMBL368311
Type:
Small organic molecule
Emp. Form.:
C10H12NO4
Mol. Mass.:
210.2071
SMILES:
CN(C)C(=O)C1[C@@H]2O[C@@H](C=C2)C1C([O-])=O
: