Target
Tissue-type plasminogen activator
Ligand
BDBM50144551
Substrate
Meas. Tech.
ChEBML_208226
IC50
>1100±n/a nM
Citation
 Sutton, JCBolton, SADavis, MEHartl, KSJacobson, BMathur, AOgletree, MLSlusarchyk, WAZahler, RSeiler, SMBisacchi, GS Solid-phase synthesis and SAR of 4-carboxy-2-azetidinone mechanism-based tryptase inhibitors. Bioorg Med Chem Lett 14:2233-9 (2004)  
Target
Name:
Tissue-type plasminogen activator
Synonyms:
Alteplase Reteplase Thrombin receptor protein Tissue-type plasminogen activator (tPA) t-PA t-plasminogen activator
Type:
Enzyme
Mol. Mass.:
62931.08
Organism:
Homo sapiens (Human)
Description:
Residue:
562
  
Inhibitor
Name:
BDBM50144551
Synonyms:
(2S,3R)-1-(4-tert-Butylcarbamoyl-piperazine-1-carbonyl)-4-oxo-3-piperidin-4-ylmethyl-azetidine-2-carboxylic acid | CHEMBL70155
Type:
Small organic molecule
Emp. Form.:
C20H33N5O5
Mol. Mass.:
423.5065
SMILES:
CC(C)(C)NC(=O)N1CCN(CC1)C(=O)N1[C@@H]([C@@H](CC2CCNCC2)C1=O)C(O)=O
: