Target
Estrogen receptor beta
Ligand
BDBM17289
Substrate
Meas. Tech.
ChEMBL_67682 (CHEMBL682169)
IC50
540±n/a nM
Citation
 Yang, WWang, YMa, ZGolla, RStouch, TSeethala, RJohnson, SZhou, RGüngör, TFeyen, JHDickson, JK Synthesis and structure-activity relationship of 3-arylbenzoxazines as selective estrogen receptor beta agonists. Bioorg Med Chem Lett 14:2327-30 (2004)  
Target
Name:
Estrogen receptor beta
Synonyms:
ER-beta ESR2_HUMAN Estradiol receptor beta (ERβ) Estrogen receptor (ER beta) Estrogen receptor beta (ER beta) NR3A2 estrogen beta
Type:
Protein
Mol. Mass.:
59238.43
Organism:
Homo sapiens (Human)
Description:
Q92731
Residue:
530
  
Inhibitor
Name:
BDBM17289
Synonyms:
(1S,10R,11S,15S)-5-hydroxy-15-methyltetracyclo[8.7.0.0^{2,7}.0^{11,15}]heptadeca-2,4,6-trien-14-one Estrone Estrone, 15 Kestrone Unigen [2,4,6,7-3H]-Estrone | folliculin
Type:
Steroid
Emp. Form.:
C18H22O2
Mol. Mass.:
270.3661
SMILES:
[H][C@@]12CCC(=O)[C@@]1(C)CC[C@]1([H])c3ccc(O)cc3CC[C@@]21[H]
: