Target
Sodium-dependent serotonin transporter
Ligand
BDBM50029153
Substrate
Meas. Tech.
ChEBML_90012
IC50
>1000±n/a nM
Citation
 Gueremy, CAudiau, FChampseix, naUzan, ALe Fur, GRataud, J 3-(4-Piperidinylalkyl)indoles, selective inhibitors of neuronal 5-hydroxytryptamine uptake. J Med Chem 23:1306-10 (1981)  
Target
Name:
Sodium-dependent serotonin transporter
Synonyms:
5-HT Transporter 5HTT SC6A4_HUMAN SLC6A4 Serotonin transporter (5HTT) Sodium-dependent serotonin transporter (SERT) | Solute carrier family 6 member 4
Type:
Multi-pass membrane protein
Mol. Mass.:
70322.51
Organism:
Homo sapiens (Human)
Description:
P31645
Residue:
630
  
Inhibitor
Name:
BDBM50029153
Synonyms:
5-Methoxy-3-(2-piperidin-4-yl-ethyl)-1H-indole | CHEMBL24731
Type:
Small organic molecule
Emp. Form.:
C16H22N2O
Mol. Mass.:
258.3587
SMILES:
COc1ccc2[nH]cc(CCC3CCNCC3)c2c1
: