Target
Sodium-dependent dopamine transporter
Ligand
BDBM77970
Substrate
Meas. Tech.
ChEBML_178952
IC50
1000±n/a nM
Citation
 Gueremy, CAudiau, FChampseix, naUzan, ALe Fur, GRataud, J 3-(4-Piperidinylalkyl)indoles, selective inhibitors of neuronal 5-hydroxytryptamine uptake. J Med Chem 23:1306-10 (1981)  
Target
Name:
Sodium-dependent dopamine transporter
Synonyms:
DA transporter SC6A3_RAT Sodium-dependent dopamine transporter | Sodium-dependent dopamine transporter (DAT)
Type:
Multi-pass membrane protein
Mol. Mass.:
68749.45
Organism:
Rattus norvegicus (rat)
Description:
P23977
Residue:
619
  
Inhibitor
Name:
BDBM77970
Synonyms:
3-(2-chloranyl-5,6-dihydrobenzo[b][1]benzazepin-11-yl)-N,N-dimethyl-propan-1-amine;hydrochloride 3-(2-chloro-5,6-dihydrobenzo[b][1]benzazepin-11-yl)-N,N-dimethylpropan-1-amine;hydrochloride CHLORIMIPRAMINE CLOMIPRAMINE HYDROCHLORIDE MLS000028511 cid_68539 | med.21724, Compound Clomipramine
Type:
Small organic molecule
Emp. Form.:
C19H23ClN2
Mol. Mass.:
314.852
SMILES:
CN(C)CCCN1c2ccccc2CCc2ccc(Cl)cc12
: