Target
Angiotensin-converting enzyme 2
Ligand
BDBM50027346
Substrate
Meas. Tech.
ChEMBL_36887 (CHEMBL648347)
IC50
3700±n/a nM
Citation
 Klutchko, SHoefle, MLSmith, RDEssenburg, ADParker, RBNemeth, VLRyan, MJDugan, DHKaplan, HR Synthesis and angiotensin-converting enzyme inhibitory activity of 3-(Mercaptomethyl)-2-oxo-1-pyrrolidineacetic acids and 3-(Mercaptomethyl)-2-oxo-1-piperidineacetic acids. J Med Chem 24:104-9 (1981)  
Target
Name:
Angiotensin-converting enzyme 2
Synonyms:
ACEI-ACE2 | Angiotensin-converting enzyme
Type:
Mol. Mass.:
Description:
ASSAY_ID of EBI is 35589
Components:
This complex has 2 components.
Component 1
Name:
Angiotensin-converting enzyme
Synonyms:
ACE Angiotensin converting enzyme (ACE) Angiotensin-converting enzyme, soluble form CD_antigen=CD143 DCP1 Kininase II
Type:
Enzyme
Mol. Mass.:
149709.01
Organism:
Homo sapiens (Human)
Description:
Residue:
1306
  
Component 2
Name:
Angiotensin-converting enzyme 2
Synonyms:
ACE-related carboxypeptidase ACE2_HUMAN Angiotensin-converting enzyme homolog Metalloprotease MPROT15
Type:
Enzyme
Mol. Mass.:
92448.86
Organism:
Homo sapiens (Human)
Description:
Residue:
805
  
Inhibitor
Name:
BDBM50027346
Synonyms:
(3-Mercaptomethyl-2-oxo-pyrrolidin-1-yl)-acetic acid | CHEMBL11507
Type:
Small organic molecule
Emp. Form.:
C7H11NO3S
Mol. Mass.:
189.232
SMILES:
OC(=O)CN1CCC(CS)C1=O
: