Target
Phenylethanolamine N-methyltransferase
Ligand
BDBM50028782
Substrate
Meas. Tech.
ChEMBL_152417 (CHEMBL763764)
IC50
454000±n/a nM
Citation
 Davis, DPBorchardt, RTGrunewald, GL Importance of the aromatic ring in adrenergic amines. 6. Nonaromatic analogues of phenylethanolamine as inhibitors of phenylethanolamine N-methyltransferase: role of pi-electronic and steric interactions. J Med Chem 24:12-6 (1981)  
Target
Name:
Phenylethanolamine N-methyltransferase
Synonyms:
Noradrenaline N-methyltransferase PNMT_BOVIN | PNMTase
Type:
Enzyme
Mol. Mass.:
30916.97
Organism:
Bos taurus (bovine)
Description:
Residue:
283
  
Inhibitor
Name:
BDBM50028782
Synonyms:
(endo)2-Amino-1-bicyclo[2.2.1]hept-5-en-2-yl-ethanol: Sulfate CHEMBL40209
Type:
Small organic molecule
Emp. Form.:
C9H15NO
Mol. Mass.:
153.2215
SMILES:
NCC(O)C1CC2CC1C=C2
: