Target
Choline O-acetyltransferase
Ligand
BDBM50079267
Substrate
Meas. Tech.
ChEMBL_49269 (CHEMBL662976)
Ki
100±n/a nM
Citation
 Mautner, HGMerrill, RECurrier, SFHarvey, G Interaction of aromatic dyes with the coenzyme A binding site of choline acetyltransferase. J Med Chem 24:1534-7 (1982)  
Target
Name:
Choline O-acetyltransferase
Synonyms:
CHAT CLAT_HUMAN Choline acetylase
Type:
PROTEIN
Mol. Mass.:
82561.12
Organism:
Homo sapiens (Human)
Description:
ChEMBL_49268
Residue:
748
  
Inhibitor
Name:
BDBM50079267
Synonyms:
Congo Red Kongorot disodium 3,3'-((1,1'-biphenyl)-4,4'-diylbis(azo))bis(4-aminonaphthalene-1-sulphonate) | disodium 3,3'-(biphenyl-4,4'-diyldidiazene-2,1-diyl)bis(4-aminonaphthalene-1-sulfonate)
Type:
Small organic molecule
Emp. Form.:
C32H22N6O6S2
Mol. Mass.:
650.685
SMILES:
Nc1c(cc(c2ccccc12)S([O-])(=O)=O)\N=N\c1ccc(cc1)-c1ccc(cc1)\N=N\c1cc(c2ccccc2c1N)S([O-])(=O)=O
: