Target
Adenylate kinase 2, mitochondrial
Ligand
BDBM50010309
Substrate
Meas. Tech.
ChEMBL_32054 (CHEMBL644153)
Ki
80000±n/a nM
Citation
 Kappler, FHai, TTAbo, MHampton, A Species- or isozyme-specific enzyme inhibitors. 8. Synthesis of disubstituted two-substrate condensation products as inhibitors of rat adenylate kinases. J Med Chem 25:1179-84 (1983)  
Target
Name:
Adenylate kinase 2, mitochondrial
Synonyms:
2.7.4.3 ATP-AMP transphosphorylase 2 Adenylate kinase 2 Adenylate monophosphate kinase KAD2_RAT
Type:
Mol. Mass.:
26380.21
Organism:
Rattus norvegicus
Description:
Residue:
239
  
Inhibitor
Name:
BDBM50010309
Synonyms:
CHEMBL3251358
Type:
Small organic molecule
Emp. Form.:
C12H20N5O13P3S
Mol. Mass.:
567.299
SMILES:
CCSc1nc2c(N)ncnc2n1[C@@H]1O[C@H](COP(O)(=O)OP(O)(=O)OP(O)(O)=O)[C@@H](O)[C@H]1O
: