Target
Mu-type opioid receptor
Ligand
BDBM50027506
Substrate
Meas. Tech.
ChEBML_148689
IC50
5.6±n/a nM
Citation
 DiMaio, JNguyen, TMLemieux, CSchiller, PW Synthesis and pharmacological characterization in vitro of cyclic enkephalin analogues: effect of conformational constraints on opiate receptor selectivity. J Med Chem 25:1432-8 (1983)  
Target
Name:
Mu-type opioid receptor
Synonyms:
MOR-1 Mu-type opioid receptor (MOR) OPRM_RAT Opioid receptor B Ror-b
Type:
G Protein-Coupled Receptor (GPCR)
Mol. Mass.:
44503.11
Organism:
Rattus norvegicus (rat)
Description:
Competition binding assays were carried out using membrane preparations from transfected HN9.10 cells that constitutively expressed the mu opioid receptor.
Residue:
398
  
Inhibitor
Name:
BDBM50027506
Synonyms:
Acetate1-(3-benzyl-2,5,8-trioxo-1,4,7triaza-cyclotridec-9-ylcarbamoyl)-2-(4-hydroxy-phenyl)-ethyl-ammonium; | CHEMBL2372200
Type:
Small organic molecule
Emp. Form.:
C28H37N5O7
Mol. Mass.:
555.6227
SMILES:
CC(O)=O.N[C@@H](Cc1ccc(O)cc1)C(=O)N[C@@H]1CCCCNC(=O)[C@H](Cc2ccccc2)NC(=O)CNC1=O
: