Target
Mu-type opioid receptor
Ligand
BDBM50027512
Substrate
Meas. Tech.
ChEMBL_149138 (CHEMBL759229)
Ki
2.3±n/a nM
Citation
 DiMaio, JNguyen, TMLemieux, CSchiller, PW Synthesis and pharmacological characterization in vitro of cyclic enkephalin analogues: effect of conformational constraints on opiate receptor selectivity. J Med Chem 25:1432-8 (1983)  
Target
Name:
Mu-type opioid receptor
Synonyms:
MOR-1 Mu-type opioid receptor (MOR) OPRM_RAT Opioid receptor B Ror-b
Type:
G Protein-Coupled Receptor (GPCR)
Mol. Mass.:
44503.11
Organism:
Rattus norvegicus (rat)
Description:
Competition binding assays were carried out using membrane preparations from transfected HN9.10 cells that constitutively expressed the mu opioid receptor.
Residue:
398
  
Inhibitor
Name:
BDBM50027512
Synonyms:
Acetate1-[1-({[1-(1-carbamoyl-3-methyl-butylcarbamoyl)-2-phenyl-ethylcarbamoyl]-methyl}-carbamoyl)-pentylcarbamoyl]-2-(4-hydroxy-phenyl)-ethyl-ammonium; | CHEMBL2372210
Type:
Small organic molecule
Emp. Form.:
C34H50N6O8
Mol. Mass.:
670.7962
SMILES:
CC(O)=O.CCCC[C@@H](NC(=O)[C@@H](N)Cc1ccc(O)cc1)C(=O)NCC(=O)N[C@@H](Cc1ccccc1)C(=O)N[C@@H](CC(C)C)C(N)=O
: