Target
Adenosine receptor A1/A2a/A2b/A3
Ligand
BDBM50080398
Substrate
Meas. Tech.
ChEMBL_194205 (CHEMBL800353)
Ki
110±n/a nM
Citation
 Daly, JW Adenosine receptors: targets for future drugs. J Med Chem 25:197-207 (1982)  
Target
Name:
Adenosine receptor A1/A2a/A2b/A3
Synonyms:
Adenosine receptor
Type:
Mol. Mass.:
Description:
ASSAY_ID of ChEMBL is 194205
Components:
This complex has 4 components.
Component 1
Name:
Adenosine receptor A2a
Synonyms:
AA2AR_RAT Adenosine A2 receptor Adenosine Receptors A2a (A2a) Adenosine receptors A2a Rat striatal adenosine A2a receptor
Type:
G Protein-Coupled Receptor (GPCR)
Mol. Mass.:
45015.65
Organism:
Rattus norvegicus (rat)
Description:
Rat A2A receptors expressed in CHO cells.
Residue:
410
  
Component 2
Name:
Adenosine receptor A3
Synonyms:
AA3R_RAT Adenosine receptor A2a and A3 | Adora3
Type:
PROTEIN
Mol. Mass.:
36643.73
Organism:
Rattus norvegicus
Description:
ChEMBL_479910
Residue:
320
  
Component 3
Name:
Adenosine receptor A1
Synonyms:
AA1R_RAT ADENOSINE A1 high Adenosine A1 receptor (A1) Adenosine receptors A1 | Adora1
Type:
Protein
Mol. Mass.:
36704.13
Organism:
Rattus norvegicus (rat)
Description:
Residue:
326
  
Component 4
Name:
Adenosine receptor A2b
Synonyms:
AA2BR_RAT Adora2b
Type:
PROTEIN
Mol. Mass.:
36378.84
Organism:
Rattus norvegicus
Description:
ChEMBL_32934
Residue:
332
  
Inhibitor
Name:
BDBM50080398
Synonyms:
(2R,3S,4R,5R)-2-Hydroxymethyl-5-[6-((S)-1-methyl-2-phenyl-ethylamino)-purin-9-yl]-tetrahydro-furan-3,4-diol CHEMBL420705 | N6-[(S)-1-Methyl-2-phenylethyl]ado (S-PIA)
Type:
Small organic molecule
Emp. Form.:
C19H23N5O4
Mol. Mass.:
385.417
SMILES:
C[C@@H](Cc1ccccc1)Nc1ncnc2n(cnc12)[C@@H]1O[C@H](CO)[C@@H](O)[C@H]1O
: