Target
Adenosine receptor A1/A2a/A2b/A3
Ligand
BDBM15336
Substrate
Meas. Tech.
ChEMBL_194012 (CHEMBL802048)
Ki
20000±n/a nM
Citation
 Daly, JW Adenosine receptors: targets for future drugs. J Med Chem 25:197-207 (1982)  
Target
Name:
Adenosine receptor A1/A2a/A2b/A3
Synonyms:
Adenosine receptor
Type:
Mol. Mass.:
Description:
ASSAY_ID of ChEMBL is 194205
Components:
This complex has 4 components.
Component 1
Name:
Adenosine receptor A2a
Synonyms:
AA2AR_RAT Adenosine A2 receptor Adenosine Receptors A2a (A2a) Adenosine receptors A2a Rat striatal adenosine A2a receptor
Type:
G Protein-Coupled Receptor (GPCR)
Mol. Mass.:
45015.65
Organism:
Rattus norvegicus (rat)
Description:
Rat A2A receptors expressed in CHO cells.
Residue:
410
  
Component 2
Name:
Adenosine receptor A3
Synonyms:
AA3R_RAT Adenosine receptor A2a and A3 | Adora3
Type:
PROTEIN
Mol. Mass.:
36643.73
Organism:
Rattus norvegicus
Description:
ChEMBL_479910
Residue:
320
  
Component 3
Name:
Adenosine receptor A1
Synonyms:
AA1R_RAT ADENOSINE A1 high Adenosine A1 receptor (A1) Adenosine receptors A1 | Adora1
Type:
Protein
Mol. Mass.:
36704.13
Organism:
Rattus norvegicus (rat)
Description:
Residue:
326
  
Component 4
Name:
Adenosine receptor A2b
Synonyms:
AA2BR_RAT Adora2b
Type:
PROTEIN
Mol. Mass.:
36378.84
Organism:
Rattus norvegicus
Description:
ChEMBL_32934
Residue:
332
  
Inhibitor
Name:
BDBM15336
Synonyms:
1-methyl-3-(2-methylpropyl)-2,3,6,7-tetrahydro-1H-purine-2,6-dione 3-Isobutyl-1-methylxanthine IBMX | isobutylmethylxanthine
Type:
Small organic molecule
Emp. Form.:
C10H14N4O2
Mol. Mass.:
222.2438
SMILES:
CC(C)Cn1c2nc[nH]c2c(=O)n(C)c1=O
: