Target
Adenylate kinase 2, mitochondrial
Ligand
BDBM50367066
Substrate
Meas. Tech.
ChEBML_32046
Ki
1800000±n/a nM
Citation
 Hampton, APicker, DNealy, KAMaeda, M Use of adenine nucleotide derivatives to assess the potential of exo-active-site-directed reagents as species- or isozyme-specific enzyme inactivators. 4. Interactions of adenosine 5'-triphosphate derivatives with adenylate kinases from Escherichia coli and rat tissues. J Med Chem 25:382-6 (1982)  
Target
Name:
Adenylate kinase 2, mitochondrial
Synonyms:
2.7.4.3 ATP-AMP transphosphorylase 2 Adenylate kinase 2 Adenylate monophosphate kinase KAD2_RAT
Type:
Mol. Mass.:
26380.21
Organism:
Rattus norvegicus
Description:
Residue:
239
  
Inhibitor
Name:
BDBM50367066
Synonyms:
CHEMBL3350509 | CHEMBL610373
Type:
Small organic molecule
Emp. Form.:
C27H47IN7O15P3
Mol. Mass.:
929.5257
SMILES:
CN(CCCCCCN(C)c1ncnc2n(cnc12)[C@@H]1O[C@H](COP(O)(=O)OP(O)(=O)OP(O)(O)=O)[C@@H](O)[C@H]1O)C(=O)CCCCCCNC(=O)CI
: