Target
Thymidine kinase, cytosolic
Ligand
BDBM50132294
Substrate
Meas. Tech.
ChEBML_123825
Ki
380000±n/a nM
Citation
 Hampton, AChawla, RRKappler, F Species- or isozyme-specific enzyme inhibitors. 5. Differential effects of thymidine substituents on affinity for rat thymidine kinase isozymes. J Med Chem 25:644-9 (1982)  
Target
Name:
Thymidine kinase, cytosolic
Synonyms:
KITH_RAT Tk-1 | Tk1
Type:
PROTEIN
Mol. Mass.:
13514.16
Organism:
Rattus norvegicus
Description:
ChEMBL_208200
Residue:
121
  
Inhibitor
Name:
BDBM50132294
Synonyms:
1-((2R,4S,5S)-4-amino-5-(hydroxymethyl)-tetrahydrofuran-2-yl)-5-methylpyrimidine-2,4(1H,3H)-dione CHEMBL103356
Type:
Small organic molecule
Emp. Form.:
C10H15N3O4
Mol. Mass.:
241.2438
SMILES:
Cc1cn([C@H]2C[C@H](N)[C@@H](CO)O2)c(=O)[nH]c1=O
: