Target
Adenylate kinase isoenzyme 1
Ligand
BDBM50367110
Substrate
Meas. Tech.
ChEMBL_32225 (CHEMBL646737)
Ki
3700000±n/a nM
Citation
 Hai, TTPicker, DAbo, MHampton, A Species- or isozyme-specific enzyme inhibitors. 7. Selective effects in inhibitions of rat adenylate kinase isozymes by adenosine 5'-phosphate derivatives. J Med Chem 25:806-12 (1982)  
Target
Name:
Adenylate kinase isoenzyme 1
Synonyms:
Adenylate kinase 1 KAD1_RAT
Type:
PROTEIN
Mol. Mass.:
21585.03
Organism:
Rattus norvegicus
Description:
ChEMBL_29909
Residue:
194
  
Inhibitor
Name:
BDBM50367110
Synonyms:
CHEMBL609073
Type:
Small organic molecule
Emp. Form.:
C12H19N6O7P
Mol. Mass.:
390.289
SMILES:
CN(C)c1nc(N)c2ncn(C3O[C@H](COP(O)(O)=O)[C@@H](O)[C@H]3O)c2n1
: