Target
Sulfotransferase 1E1
Ligand
BDBM50367131
Substrate
Meas. Tech.
ChEBML_67841
Ki
350000±n/a nM
Citation
 Iyer, VKButler, WBHorwitz, JPRozhin, JBrooks, SCCorombos, JKessel, D Some adenine and adenosine methylene-bridged estrogens. J Med Chem 26:162-6 (1983)  
Target
Name:
Sulfotransferase 1E1
Synonyms:
Estrogen sulfotransferase ST1E1 STE Sulfotransferase, estrogen-preferring
Type:
PROTEIN
Mol. Mass.:
34642.12
Organism:
Bos taurus
Description:
ChEMBL_67841
Residue:
295
  
Inhibitor
Name:
BDBM50367131
Synonyms:
CHEMBL1628164
Type:
Small organic molecule
Emp. Form.:
C26H30N6O4
Mol. Mass.:
490.5542
SMILES:
C[C@]12CC[C@H]3[C@@H](CCc4c3ccc(OCCCn3cnc5c(N)ncnc35)c4[N+]([O-])=O)[C@@H]1CCC2=O
: