Target
Angiotensin-converting enzyme
Ligand
BDBM50021127
Substrate
Meas. Tech.
ChEBML_34781
IC50
5.20±n/a nM
Citation
 Watthey, JWStanton, JLDesai, MBabiarz, JEFinn, BM Synthesis and biological properties of (carboxyalkyl)amino-substituted bicyclic lactam inhibitors of angiotensin converting enzyme. J Med Chem 28:1511-6 (1985)  
Target
Name:
Angiotensin-converting enzyme
Synonyms:
3.2.1.- ACE Angiotensin-converting enzyme, soluble form DCP1 Kininase II
Type:
Mol. Mass.:
150405.15
Organism:
Oryctolagus cuniculus
Description:
Residue:
1310
  
Inhibitor
Name:
BDBM50021127
Synonyms:
2-(1-Carboxymethyl-2-oxo-2,3,4,5-tetrahydro-1H-benzo[b]azepin-3-ylamino)-4-phenyl-butyric acid; hydrochloride | CHEMBL543766
Type:
Small organic molecule
Emp. Form.:
C22H24N2O5
Mol. Mass.:
396.4364
SMILES:
OC(=O)CN1c2ccccc2CC[C@H](N[C@@H](CCc2ccccc2)C(O)=O)C1=O
: