Target
Angiotensin-converting enzyme
Ligand
BDBM50021135
Substrate
Meas. Tech.
ChEBML_35221
IC50
1.7±n/a nM
Citation
 Slade, JStanton, JLBen-David, DMazzenga, GC Angiotensin converting enzyme inhibitors: 1,5-benzothiazepine derivatives. J Med Chem 28:1517-21 (1985)  
Target
Name:
Angiotensin-converting enzyme
Synonyms:
ACE_RAT Angiotensin-converting enzyme | Dcp1
Type:
PROTEIN
Mol. Mass.:
150907.81
Organism:
Rattus norvegicus
Description:
ChEMBL_35219
Residue:
1313
  
Inhibitor
Name:
BDBM50021135
Synonyms:
2-(1-Carboxymethyl-2-oxo-2,3,4,5-tetrahydro-1H-benzo[b]azepin-3-ylamino)-4-phenyl-butyric acid | CHEMBL36429
Type:
Small organic molecule
Emp. Form.:
C22H24N2O5
Mol. Mass.:
396.4364
SMILES:
OC(=O)CN1c2ccccc2CC[C@H](NC(CCc2ccccc2)C(O)=O)C1=O
: