Target
Angiotensin-converting enzyme
Ligand
BDBM50021152
Substrate
Meas. Tech.
ChEBML_35992
IC50
10±n/a nM
Citation
 Stanton, JLWatthey, JWDesai, MNFinn, BMBabiarz, JETomaselli, HC Angiotensin converting enzyme inhibitors: structure-activity profile of 1-benzazepin-2-one derivatives. J Med Chem 28:1603-6 (1985)  
Target
Name:
Angiotensin-converting enzyme
Synonyms:
ACE Angiotensin converting enzyme (ACE) Angiotensin-converting enzyme, soluble form CD_antigen=CD143 DCP1 Kininase II
Type:
Enzyme
Mol. Mass.:
149709.01
Organism:
Homo sapiens (Human)
Description:
Residue:
1306
  
Inhibitor
Name:
BDBM50021152
Synonyms:
3-Benzyloxy-2-(1-carboxymethyl-2-oxo-2,3,4,5-tetrahydro-1H-benzo[b]azepin-3-ylamino)-propionic acid | CHEMBL42683
Type:
Small organic molecule
Emp. Form.:
C22H24N2O6
Mol. Mass.:
412.4358
SMILES:
OC(=O)CN1c2ccccc2CC[C@H](N[C@@H](COCc2ccccc2)C(O)=O)C1=O
: