Target
Sodium-dependent dopamine transporter
Ligand
BDBM50021226
Substrate
Meas. Tech.
ChEBML_176345
IC50
0.990000±n/a nM
Citation
 Bøgesø, KPChristensen, AVHyttel, JLiljefors, T 3-Phenyl-1-indanamines. Potential antidepressant activity and potent inhibition of dopamine, norepinephrine, and serotonin uptake. J Med Chem 28:1817-28 (1986)  
Target
Name:
Sodium-dependent dopamine transporter
Synonyms:
DA transporter SC6A3_RAT Sodium-dependent dopamine transporter | Sodium-dependent dopamine transporter (DAT)
Type:
Multi-pass membrane protein
Mol. Mass.:
68749.45
Organism:
Rattus norvegicus (rat)
Description:
P23977
Residue:
619
  
Inhibitor
Name:
BDBM50021226
Synonyms:
CHEMBL296602 [3-(3,4-Dichloro-phenyl)-indan-1-yl]-methyl-amine | [3-(3,4-Dichloro-phenyl)-indan-1-yl]-methyl-amine; hydrochloride
Type:
Small organic molecule
Emp. Form.:
C16H15Cl2N
Mol. Mass.:
292.203
SMILES:
CNC1CC(c2ccccc12)c1ccc(Cl)c(Cl)c1
: