Target
Transporter
Ligand
BDBM50021235
Substrate
Meas. Tech.
ChEMBL_176350 (CHEMBL781943)
IC50
0.510000±n/a nM
Citation
 Bøgesø, KPChristensen, AVHyttel, JLiljefors, T 3-Phenyl-1-indanamines. Potential antidepressant activity and potent inhibition of dopamine, norepinephrine, and serotonin uptake. J Med Chem 28:1817-28 (1986)  
Target
Name:
Transporter
Synonyms:
Monoamine transporters; Norepininephrine & dopamine | Norepinephrine Monoamine transporters
Type:
PROTEIN
Mol. Mass.:
66787.87
Organism:
Rattus norvegicus
Description:
ChEMBL_1463061
Residue:
597
  
Inhibitor
Name:
BDBM50021235
Synonyms:
CHEMBL51224 [3-(4-Chloro-phenyl)-indan-1-yl]-methyl-amine | [3-(4-Chloro-phenyl)-indan-1-yl]-methyl-amine; hydrochloride
Type:
Small organic molecule
Emp. Form.:
C16H16ClN
Mol. Mass.:
257.758
SMILES:
CNC1CC(c2ccccc12)c1ccc(Cl)cc1
: