Target
Transporter
Ligand
BDBM50021246
Substrate
Meas. Tech.
ChEBML_176350
IC50
2.9±n/a nM
Citation
 Bøgesø, KPChristensen, AVHyttel, JLiljefors, T 3-Phenyl-1-indanamines. Potential antidepressant activity and potent inhibition of dopamine, norepinephrine, and serotonin uptake. J Med Chem 28:1817-28 (1986)  
Target
Name:
Transporter
Synonyms:
Monoamine transporters; Norepininephrine & dopamine | Norepinephrine Monoamine transporters
Type:
PROTEIN
Mol. Mass.:
66787.87
Organism:
Rattus norvegicus
Description:
ChEMBL_1463061
Residue:
597
  
Inhibitor
Name:
BDBM50021246
Synonyms:
3-(3,3-dimethyl-1-phenyl-1,3-dihydroisobenzofuran-1-yl)-N-methylpropan-1-amine [3-(3,3-Dimethyl-1-phenyl-1,3-dihydro-isobenzofuran-1-yl)-propyl]-methyl-amine(Talopram)
Type:
Small organic molecule
Emp. Form.:
C20H25NO
Mol. Mass.:
295.4186
SMILES:
CNCCCC1(OC(C)(C)c2ccccc12)c1ccccc1
: